##############################################################################
# Parameters describing the geometry of the Mdc
#
# Format:
#   [MdcGeomLabPositions] lab positions of the modules:
#      name of volume   name of reference module
#      rotation matrix
#      translation vector
#
#   [MdcGeomVolumes] parameters of the volumes:
#      name of volume   shape   name of mother
#      x, y and z components of points 
#      rotation matrix
#      translation vector
#
##############################################################################
[MdcGeomLabPositions]
// ------------------------------------------------------
DR1M1  DR1M1
 0.9999975  0.0009782 -0.0019591  0.0006765  0.7130002  0.7011638  0.0020830 -0.7011632  0.7129976
    3.316   387.892   368.589
// ------------------------------------------------------
DR2M1  DR2M1
 0.9999764  0.0020044 -0.0066107  0.0041737  0.5872736  0.8093770  0.0055047 -0.8093853  0.5872520
   -1.652   582.415   423.658
// ------------------------------------------------------
DR3M1  DR3M1
 0.9999670  0.0023324 -0.0077611  0.0044279  0.6448631  0.7642856  0.0067874 -0.7642946  0.6448312
    1.966  1053.114   918.556
// ------------------------------------------------------
DR4M1  DR4M1
 0.9999641  0.0010459 -0.0084145  0.0057645  0.6439390  0.7650555  0.0062184 -0.7650761  0.6439094
    1.833  1283.315  1112.612
// ------------------------------------------------------
DR1M2  DR1M1
 0.4991297 -0.6187721 -0.6066215  0.8665222  0.3541273  0.3517577 -0.0028364 -0.7012235  0.7129358
 -337.262   194.099   368.640
// ------------------------------------------------------
DR2M2  DR2M1
 0.4995395 -0.5063068 -0.7029324  0.8662909  0.2928633  0.4046863  0.0009677 -0.8111006  0.5849062
 -509.731   290.955   421.493
// ------------------------------------------------------
DR3M2  DR3M1
 0.5009242 -0.5650094 -0.6556213  0.8654890  0.3253660  0.3808750 -0.0018809 -0.7582227  0.6519934
 -914.007   529.885   920.207
// ------------------------------------------------------
DR4M2  DR4M1
 0.5002316 -0.5654275 -0.6557898  0.8658880  0.3244470  0.3807521 -0.0025189 -0.7583048  0.6518957
-1111.700   644.176  1116.276
// ------------------------------------------------------
DR1M3  DR1M1
-0.4988079 -0.6181010 -0.6075703  0.8667053 -0.3586580 -0.3466801 -0.0036273 -0.6995108  0.7146130
 -337.686  -200.167   370.123
// ------------------------------------------------------
DR2M3  DR2M1
-0.5005615 -0.5062938 -0.7022146  0.8657007 -0.2925897 -0.4061436  0.0001678 -0.8112079  0.5847585
 -510.098  -296.168   421.788
// ------------------------------------------------------
DR3M3  DR3M1
-0.4991285 -0.5683210 -0.6541268  0.8665025 -0.3215719 -0.3817921  0.0066317 -0.7573660  0.6529573
 -908.094  -528.999   922.007
// ------------------------------------------------------
DR4M3  DR4M1
-0.4993602 -0.5681266 -0.6541188  0.8663669 -0.3214133 -0.3822331  0.0069143 -0.7575790  0.6527072
-1101.798  -643.582  1119.499
// ------------------------------------------------------
DR1M4  DR1M1
-0.9999914  0.0028577 -0.0028959 -0.0000380 -0.7182703 -0.6957635 -0.0040681 -0.6957582  0.7182645
    1.691  -398.204   371.293
// ------------------------------------------------------
DR2M4  DR2M1
-0.9999926  0.0039043  0.0003516 -0.0025710 -0.5855451 -0.8106365 -0.0029589 -0.8106310  0.5855502
   -2.188  -589.478   422.025
// ------------------------------------------------------
DR3M4  DR3M1
-0.9999782 -0.0060369 -0.0025105  0.0058220 -0.6475282 -0.7620192  0.0029750 -0.7620175  0.6475496
    2.726 -1049.922   928.890
// ------------------------------------------------------
DR4M4  DR4M1
-0.9999803 -0.0057990 -0.0023280  0.0055276 -0.6471872 -0.7623113  0.0029145 -0.7623093  0.6472065
    1.360 -1278.178  1124.794
// ------------------------------------------------------
DR1M5  DR1M1
-0.4995085  0.6227442  0.6022292 -0.8663031 -0.3563059 -0.3500944 -0.0034418 -0.6965878  0.7174626
  342.201  -200.473   371.314
// ------------------------------------------------------
DR2M5  DR2M1
-0.4972272  0.5101299  0.7018061 -0.8676175 -0.2902437 -0.4037309 -0.0022608 -0.8096455  0.5869149
  504.962  -294.707   423.747
// ------------------------------------------------------
DR3M5  DR3M1
-0.5002249  0.5656666  0.6555887 -0.8658867 -0.3233263 -0.3817073 -0.0039498 -0.7586049  0.6515390
  915.253  -531.248   929.505
// ------------------------------------------------------
DR4M5  DR4M1
-0.5007124  0.5658890  0.6550243 -0.8656006 -0.3231769 -0.3824816 -0.0047537 -0.7585029  0.6516525
 1112.648  -646.685  1128.184
// ------------------------------------------------------
DR1M6  DR1M1
 0.4996561  0.6203989  0.6045239 -0.8662195  0.3557163  0.3508979  0.0026575 -0.6989783  0.7151376
  343.544   193.088   371.469
// ------------------------------------------------------
DR2M6  DR2M1
 0.5009615  0.5105889  0.6988114 -0.8654698  0.2952930  0.4046782  0.0002699 -0.8075272  0.5898300
  505.441   290.663   425.040
// ------------------------------------------------------
DR3M6  DR3M1
 0.5008483  0.5642655  0.6563199 -0.8655332  0.3280703  0.3784465 -0.0017748 -0.7576110  0.6527041
  912.392   525.332   927.605
// ------------------------------------------------------
DR4M6  DR4M1
 0.5008014  0.5644135  0.6562281 -0.8655609  0.3279011  0.3785302 -0.0015306 -0.7575738  0.6527477
 1109.064   638.647  1124.094
##############################################################################
[MdcGeomVolumes]
// ------------------------------------------------------
DR1M1  TRAP  CAVE
   53.629  -385.000   -27.300
  451.028   575.000   -27.300
 -451.028   575.000   -27.300
  -53.629  -385.000   -27.300
   74.152  -385.000    25.376
  471.551   575.000    25.376
 -471.551   575.000    25.376
  -74.152  -385.000    25.376
 1.0000000  0.0000000  0.0000000  0.0000000  0.7169650  0.6971090  0.0000000 -0.6971090  0.7169650
    0.000   392.354   403.529
// ------------------------------------------------------
D1S1  TRD1  DR1M1
   60.240  -301.000    -0.038
  370.936   468.000    -0.038
 -370.936   468.000    -0.038
  -60.240  -301.000    -0.038
   60.240  -301.000     0.038
  370.936   468.000     0.038
 -370.936   468.000     0.038
  -60.240  -301.000     0.038
 1.0000000  0.0000000  0.0000000  0.0000000  1.0000000  0.0000000  0.0000000  0.0000000  1.0000000
    0.000     0.000   -12.712
// ------------------------------------------------------
D1S2  TRD1  DR1M1
   60.740  -301.000    -0.038
  374.264   468.000    -0.038
 -374.264   468.000    -0.038
  -60.740  -301.000    -0.038
   60.740  -301.000     0.038
  374.264   468.000     0.038
 -374.264   468.000     0.038
  -60.740  -301.000     0.038
 1.0000000  0.0000000  0.0000000  0.0000000  1.0000000  0.0000000  0.0000000  0.0000000  1.0000000
    0.000     0.000    -7.612
// ------------------------------------------------------
D1S3  TRD1  DR1M1
   61.240  -307.000    -0.038
  377.592   476.000    -0.038
 -377.592   476.000    -0.038
  -61.240  -307.000    -0.038
   61.240  -307.000     0.038
  377.592   476.000     0.038
 -377.592   476.000     0.038
  -61.240  -307.000     0.038
 1.0000000  0.0000000  0.0000000  0.0000000  1.0000000  0.0000000  0.0000000  0.0000000  1.0000000
    0.000     0.000    -2.512
// ------------------------------------------------------
D1S4  TRD1  DR1M1
   61.740  -310.000    -0.038
  380.921   480.000    -0.038
 -380.921   480.000    -0.038
  -61.740  -310.000    -0.038
   61.740  -310.000     0.038
  380.921   480.000     0.038
 -380.921   480.000     0.038
  -61.740  -310.000     0.038
 1.0000000  0.0000000  0.0000000  0.0000000  1.0000000  0.0000000  0.0000000  0.0000000  1.0000000
    0.000     0.000     2.588
// ------------------------------------------------------
D1S5  TRD1  DR1M1
   61.990  -313.000    -0.038
  383.999   484.000    -0.038
 -383.999   484.000    -0.038
  -61.990  -313.000    -0.038
   61.990  -313.000     0.038
  383.999   484.000     0.038
 -383.999   484.000     0.038
  -61.990  -313.000     0.038
 1.0000000  0.0000000  0.0000000  0.0000000  1.0000000  0.0000000  0.0000000  0.0000000  1.0000000
    0.000     0.000     7.688
// ------------------------------------------------------
D1S6  TRD1  DR1M1
   61.990  -313.000    -0.038
  386.827   484.000    -0.038
 -386.827   484.000    -0.038
  -61.990  -313.000    -0.038
   61.990  -313.000     0.038
  386.827   484.000     0.038
 -386.827   484.000     0.038
  -61.990  -313.000     0.038
 1.0000000  0.0000000  0.0000000  0.0000000  1.0000000  0.0000000  0.0000000  0.0000000  1.0000000
    0.000     0.000    12.788
// ------------------------------------------------------
DR2M1  TRAP  CAVE
   99.500  -657.100   -28.100
  500.300   523.700   -28.100
 -500.300   523.700   -28.100
  -99.500  -657.100   -28.100
  129.700  -657.100    36.500
  530.500   523.700    36.500
 -530.500   523.700    36.500
 -129.700  -657.100    36.500
 1.0000000  0.0000000  0.0000000  0.0000000  0.5878610  0.8089620  0.0000000 -0.8089620  0.5878610
    0.000   585.842   425.723
// ------------------------------------------------------
D2S1  TRD1  DR2M1
   88.500  -589.600    -0.040
  440.400   447.200    -0.040
 -440.400   447.200    -0.040
  -88.500  -589.600    -0.040
   88.500  -589.600     0.040
  440.400   447.200     0.040
 -440.400   447.200     0.040
  -88.500  -589.600     0.040
 1.0000000  0.0000000  0.0000000  0.0000000  1.0000000  0.0000000  0.0000000  0.0000000  1.0000000
    0.000     0.000   -12.700
// ------------------------------------------------------
D2S2  TRD1  DR2M1
   90.700  -589.600    -0.040
  442.700   447.200    -0.040
 -442.700   447.200    -0.040
  -90.700  -589.600    -0.040
   90.700  -589.600     0.040
  442.700   447.200     0.040
 -442.700   447.200     0.040
  -90.700  -589.600     0.040
 1.0000000  0.0000000  0.0000000  0.0000000  1.0000000  0.0000000  0.0000000  0.0000000  1.0000000
    0.000     0.000    -7.620
// ------------------------------------------------------
D2S3  TRD1  DR2M1
   93.500  -589.600    -0.040
  445.400   447.200    -0.040
 -445.400   447.200    -0.040
  -93.500  -589.600    -0.040
   93.500  -589.600     0.040
  445.400   447.200     0.040
 -445.400   447.200     0.040
  -93.500  -589.600     0.040
 1.0000000  0.0000000  0.0000000  0.0000000  1.0000000  0.0000000  0.0000000  0.0000000  1.0000000
    0.000     0.000    -2.540
// ------------------------------------------------------
D2S4  TRD1  DR2M1
   95.800  -589.600    -0.040
  447.800   447.200    -0.040
 -447.800   447.200    -0.040
  -95.800  -589.600    -0.040
   95.800  -589.600     0.040
  447.800   447.200     0.040
 -447.800   447.200     0.040
  -95.800  -589.600     0.040
 1.0000000  0.0000000  0.0000000  0.0000000  1.0000000  0.0000000  0.0000000  0.0000000  1.0000000
    0.000     0.000     2.540
// ------------------------------------------------------
D2S5  TRD1  DR2M1
   98.100  -589.600    -0.040
  450.100   447.200    -0.040
 -450.100   447.200    -0.040
  -98.100  -589.600    -0.040
   98.100  -589.600     0.040
  450.100   447.200     0.040
 -450.100   447.200     0.040
  -98.100  -589.600     0.040
 1.0000000  0.0000000  0.0000000  0.0000000  1.0000000  0.0000000  0.0000000  0.0000000  1.0000000
    0.000     0.000     7.620
// ------------------------------------------------------
D2S6  TRD1  DR2M1
  100.400  -589.600    -0.040
  452.300   447.200    -0.040
 -452.300   447.200    -0.040
 -100.400  -589.600    -0.040
  100.400  -589.600     0.040
  452.300   447.200     0.040
 -452.300   447.200     0.040
 -100.400  -589.600     0.040
 1.0000000  0.0000000  0.0000000  0.0000000  1.0000000  0.0000000  0.0000000  0.0000000  1.0000000
    0.000     0.000    12.700
// ------------------------------------------------------
DR3M1  TRAP  CAVE
  164.050 -1100.000   -48.000
 1030.720  1193.000   -48.000
-1030.720  1193.000   -48.000
 -164.050 -1100.000   -48.000
  208.150 -1100.000    53.000
 1074.830  1193.000    53.000
-1074.830  1193.000    53.000
 -208.150 -1100.000    53.000
 1.0000000  0.0000000  0.0000000  0.0000000  0.6546540  0.7559290  0.0000000 -0.7559290  0.6546540
    0.000  1040.677   901.253
// ------------------------------------------------------
D3S1  TRD1  DR3M1
  139.000 -1000.000    -0.050
  910.000  1060.000    -0.050
 -910.000  1060.000    -0.050
 -139.000 -1000.000    -0.050
  139.000 -1000.000     0.050
  910.000  1060.000     0.050
 -910.000  1060.000     0.050
 -139.000 -1000.000     0.050
 1.0000000  0.0000000  0.0000000  0.0000000  1.0000000  0.0000000  0.0000000  0.0000000  1.0000000
    0.000     0.000   -19.950
// ------------------------------------------------------
D3S2  TRD1  DR3M1
  142.000 -1000.000    -0.050
  913.000  1060.000    -0.050
 -913.000  1060.000    -0.050
 -142.000 -1000.000    -0.050
  142.000 -1000.000     0.050
  913.000  1060.000     0.050
 -913.000  1060.000     0.050
 -142.000 -1000.000     0.050
 1.0000000  0.0000000  0.0000000  0.0000000  1.0000000  0.0000000  0.0000000  0.0000000  1.0000000
    0.000     0.000   -11.950
// ------------------------------------------------------
D3S3  TRD1  DR3M1
  145.000 -1000.000    -0.050
  916.000  1060.000    -0.050
 -916.000  1060.000    -0.050
 -145.000 -1000.000    -0.050
  145.000 -1000.000     0.050
  916.000  1060.000     0.050
 -916.000  1060.000     0.050
 -145.000 -1000.000     0.050
 1.0000000  0.0000000  0.0000000  0.0000000  1.0000000  0.0000000  0.0000000  0.0000000  1.0000000
    0.000     0.000    -3.950
// ------------------------------------------------------
D3S4  TRD1  DR3M1
  148.000 -1000.000    -0.050
  919.000  1060.000    -0.050
 -919.000  1060.000    -0.050
 -148.000 -1000.000    -0.050
  148.000 -1000.000     0.050
  919.000  1060.000     0.050
 -919.000  1060.000     0.050
 -148.000 -1000.000     0.050
 1.0000000  0.0000000  0.0000000  0.0000000  1.0000000  0.0000000  0.0000000  0.0000000  1.0000000
    0.000     0.000     4.050
// ------------------------------------------------------
D3S5  TRD1  DR3M1
  151.000 -1000.000    -0.050
  922.000  1060.000    -0.050
 -922.000  1060.000    -0.050
 -151.000 -1000.000    -0.050
  151.000 -1000.000     0.050
  922.000  1060.000     0.050
 -922.000  1060.000     0.050
 -151.000 -1000.000     0.050
 1.0000000  0.0000000  0.0000000  0.0000000  1.0000000  0.0000000  0.0000000  0.0000000  1.0000000
    0.000     0.000    12.050
// ------------------------------------------------------
D3S6  TRD1  DR3M1
  154.000 -1000.000    -0.050
  925.000  1060.000    -0.050
 -925.000  1060.000    -0.050
 -154.000 -1000.000    -0.050
  154.000 -1000.000     0.050
  925.000  1060.000     0.050
 -925.000  1060.000     0.050
 -154.000 -1000.000     0.050
 1.0000000  0.0000000  0.0000000  0.0000000  1.0000000  0.0000000  0.0000000  0.0000000  1.0000000
    0.000     0.000    20.050
// ------------------------------------------------------
DR4M1  TRAP  CAVE
  170.735 -1413.000   -55.000
 1235.790  1444.000   -55.000
-1235.790  1444.000   -55.000
 -170.735 -1413.000   -55.000
  208.922 -1413.000    60.000
 1273.977  1444.000    60.000
-1273.977  1444.000    60.000
 -208.922 -1413.000    60.000
 1.0000000  0.0000000  0.0000000  0.0000000  0.6546540  0.7559290  0.0000000 -0.7559290  0.6546540
    0.000  1267.451  1097.645
// ------------------------------------------------------
D4S1  TRD1  DR4M1
  146.355 -1278.000    -0.050
 1116.350  1324.000    -0.050
-1116.350  1324.000    -0.050
 -146.355 -1278.000    -0.050
  146.355 -1278.000     0.050
 1116.350  1324.000     0.050
-1116.350  1324.000     0.050
 -146.355 -1278.000     0.050
 1.0000000  0.0000000  0.0000000  0.0000000  1.0000000  0.0000000  0.0000000  0.0000000  1.0000000
    0.000     0.000   -24.950
// ------------------------------------------------------
D4S2  TRD1  DR4M1
  146.355 -1278.000    -0.050
 1116.350  1324.000    -0.050
-1116.350  1324.000    -0.050
 -146.355 -1278.000    -0.050
  146.355 -1278.000     0.050
 1116.350  1324.000     0.050
-1116.350  1324.000     0.050
 -146.355 -1278.000     0.050
 1.0000000  0.0000000  0.0000000  0.0000000  1.0000000  0.0000000  0.0000000  0.0000000  1.0000000
    0.000     0.000   -14.950
// ------------------------------------------------------
D4S3  TRD1  DR4M1
  153.830 -1278.000    -0.050
 1123.820  1324.000    -0.050
-1123.820  1324.000    -0.050
 -153.830 -1278.000    -0.050
  153.830 -1278.000     0.050
 1123.820  1324.000     0.050
-1123.820  1324.000     0.050
 -153.830 -1278.000     0.050
 1.0000000  0.0000000  0.0000000  0.0000000  1.0000000  0.0000000  0.0000000  0.0000000  1.0000000
    0.000     0.000    -4.950
// ------------------------------------------------------
D4S4  TRD1  DR4M1
  153.830 -1278.000    -0.050
 1123.820  1324.000    -0.050
-1123.820  1324.000    -0.050
 -153.830 -1278.000    -0.050
  153.830 -1278.000     0.050
 1123.820  1324.000     0.050
-1123.820  1324.000     0.050
 -153.830 -1278.000     0.050
 1.0000000  0.0000000  0.0000000  0.0000000  1.0000000  0.0000000  0.0000000  0.0000000  1.0000000
    0.000     0.000     5.050
// ------------------------------------------------------
D4S5  TRD1  DR4M1
  161.300 -1278.000    -0.050
 1131.290  1324.000    -0.050
-1131.290  1324.000    -0.050
 -161.300 -1278.000    -0.050
  161.300 -1278.000     0.050
 1131.290  1324.000     0.050
-1131.290  1324.000     0.050
 -161.300 -1278.000     0.050
 1.0000000  0.0000000  0.0000000  0.0000000  1.0000000  0.0000000  0.0000000  0.0000000  1.0000000
    0.000     0.000    15.050
// ------------------------------------------------------
D4S6  TRD1  DR4M1
  161.300 -1278.000    -0.050
 1131.290  1324.000    -0.050
-1131.290  1324.000    -0.050
 -161.300 -1278.000    -0.050
  161.300 -1278.000     0.050
 1131.290  1324.000     0.050
-1131.290  1324.000     0.050
 -161.300 -1278.000     0.050
 1.0000000  0.0000000  0.0000000  0.0000000  1.0000000  0.0000000  0.0000000  0.0000000  1.0000000
    0.000     0.000    25.050
##############################################################################
