//----------------------------------------------------------
T15F1
SEC1
BOX 
CARBONFIBRE$
  755.000   -83.000   -11.250
  755.000    83.000   -11.250
 -755.000    83.000   -11.250
 -755.000   -83.000   -11.250
  755.000   -83.000    11.250
  755.000    83.000    11.250
 -755.000    83.000    11.250
 -755.000   -83.000    11.250
0.000 1481.325 1453.070
1.0000000  0.0000000  0.0000000  0.0000000  0.6971651  0.7169106  0.0000000  -0.7169106  0.6971651  
//----------------------------------------------------------
T15I
T15F1
BOX 
INSULATOR_TOF$
  755.000   -82.000   -10.250
  755.000    82.000   -10.250
 -755.000    82.000   -10.250
 -755.000   -82.000   -10.250
  755.000   -82.000    10.250
  755.000    82.000    10.250
 -755.000    82.000    10.250
 -755.000   -82.000    10.250
0.000 0.000 0.000
1.0000000  0.0000000  0.0000000  0.0000000  1.0000000  0.0000000  0.0000000  0.0000000  1.0000000  
//----------------------------------------------------------
T15S1
T15I
BOX 
SCINTILLATOR$
  737.500   -10.000   -10.000
  737.500    10.000   -10.000
 -737.500    10.000   -10.000
 -737.500   -10.000   -10.000
  737.500   -10.000    10.000
  737.500    10.000    10.000
 -737.500    10.000    10.000
 -737.500   -10.000    10.000
-17.500 -71.750 0.000
1.0000000  0.0000000  0.0000000  0.0000000  1.0000000  0.0000000  0.0000000  0.0000000  1.0000000  
//----------------------------------------------------------
T15S2
T15I
17.500 -51.250 0.000
1.0000000  0.0000000  0.0000000  0.0000000  1.0000000  0.0000000  0.0000000  0.0000000  1.0000000  
//----------------------------------------------------------
T15S3
T15I
-17.500 -30.750 0.000
1.0000000  0.0000000  0.0000000  0.0000000  1.0000000  0.0000000  0.0000000  0.0000000  1.0000000  
//----------------------------------------------------------
T15S4
T15I
17.500 -10.250 0.000
1.0000000  0.0000000  0.0000000  0.0000000  1.0000000  0.0000000  0.0000000  0.0000000  1.0000000  
//----------------------------------------------------------
T15S5
T15I
-17.500 10.250 0.000
1.0000000  0.0000000  0.0000000  0.0000000  1.0000000  0.0000000  0.0000000  0.0000000  1.0000000  
//----------------------------------------------------------
T15S6
T15I
17.500 30.750 0.000
1.0000000  0.0000000  0.0000000  0.0000000  1.0000000  0.0000000  0.0000000  0.0000000  1.0000000  
//----------------------------------------------------------
T15S7
T15I
-17.500 51.250 0.000
1.0000000  0.0000000  0.0000000  0.0000000  1.0000000  0.0000000  0.0000000  0.0000000  1.0000000  
//----------------------------------------------------------
T15S8
T15I
17.500 71.750 0.000
1.0000000  0.0000000  0.0000000  0.0000000  1.0000000  0.0000000  0.0000000  0.0000000  1.0000000  
//----------------------------------------------------------
T16F1
SEC1
BOX 
CARBONFIBRE$
  830.000   -83.000   -11.250
  830.000    83.000   -11.250
 -830.000    83.000   -11.250
 -830.000   -83.000   -11.250
  830.000   -83.000    11.250
  830.000    83.000    11.250
 -830.000    83.000    11.250
 -830.000   -83.000    11.250
0.000 1615.753 1349.222
1.0000000  0.0000000  0.0000000  0.0000000  0.6387678  0.7693996  0.0000000  -0.7693996  0.6387678  
//----------------------------------------------------------
T16I
T16F1
BOX 
INSULATOR_TOF$
  830.000   -82.000   -10.250
  830.000    82.000   -10.250
 -830.000    82.000   -10.250
 -830.000   -82.000   -10.250
  830.000   -82.000    10.250
  830.000    82.000    10.250
 -830.000    82.000    10.250
 -830.000   -82.000    10.250
0.000 0.000 0.000
1.0000000  0.0000000  0.0000000  0.0000000  1.0000000  0.0000000  0.0000000  0.0000000  1.0000000  
//----------------------------------------------------------
T16S6
T16I
BOX 
SCINTILLATOR$
  812.500   -10.000   -10.000
  812.500    10.000   -10.000
 -812.500    10.000   -10.000
 -812.500   -10.000   -10.000
  812.500   -10.000    10.000
  812.500    10.000    10.000
 -812.500    10.000    10.000
 -812.500   -10.000    10.000
17.500 30.750 0.000
1.0000000  0.0000000  0.0000000  0.0000000  1.0000000  0.0000000  0.0000000  0.0000000  1.0000000  
//----------------------------------------------------------
T16S1
T16I
-17.500 -71.750 0.000
1.0000000  0.0000000  0.0000000  0.0000000  1.0000000  0.0000000  0.0000000  0.0000000  1.0000000  
//----------------------------------------------------------
T16S3
T16I
-17.500 -30.750 0.000
1.0000000  0.0000000  0.0000000  0.0000000  1.0000000  0.0000000  0.0000000  0.0000000  1.0000000  
//----------------------------------------------------------
T16S7
T16I
-17.500 51.250 0.000
1.0000000  0.0000000  0.0000000  0.0000000  1.0000000  0.0000000  0.0000000  0.0000000  1.0000000  
//----------------------------------------------------------
T16S8
T16I
17.500 71.750 0.000
1.0000000  0.0000000  0.0000000  0.0000000  1.0000000  0.0000000  0.0000000  0.0000000  1.0000000  
//----------------------------------------------------------
T16S4
T16I
17.500 -10.250 0.000
1.0000000  0.0000000  0.0000000  0.0000000  1.0000000  0.0000000  0.0000000  0.0000000  1.0000000  
//----------------------------------------------------------
T16S2
T16I
17.500 -51.250 0.000
1.0000000  0.0000000  0.0000000  0.0000000  1.0000000  0.0000000  0.0000000  0.0000000  1.0000000  
//----------------------------------------------------------
T16S5
T16I
-17.500 10.250 0.000
1.0000000  0.0000000  0.0000000  0.0000000  1.0000000  0.0000000  0.0000000  0.0000000  1.0000000  
//----------------------------------------------------------
T17F1
SEC1
BOX 
CARBONFIBRE$
  915.000   -83.000   -11.250
  915.000    83.000   -11.250
 -915.000    83.000   -11.250
 -915.000   -83.000   -11.250
  915.000   -83.000    11.250
  915.000    83.000    11.250
 -915.000    83.000    11.250
 -915.000   -83.000    11.250
0.000 1742.875 1233.134
1.0000000  0.0000000  0.0000000  0.0000000  0.5764323  0.8171449  0.0000000  -0.8171449  0.5764323  
//----------------------------------------------------------
T17I
T17F1
BOX 
INSULATOR_TOF$
  915.000   -82.000   -10.250
  915.000    82.000   -10.250
 -915.000    82.000   -10.250
 -915.000   -82.000   -10.250
  915.000   -82.000    10.250
  915.000    82.000    10.250
 -915.000    82.000    10.250
 -915.000   -82.000    10.250
0.000 0.000 0.000
1.0000000  0.0000000  0.0000000  0.0000000  1.0000000  0.0000000  0.0000000  0.0000000  1.0000000  
//----------------------------------------------------------
T17S1
T17I
BOX 
SCINTILLATOR$
  897.500   -10.000   -10.000
  897.500    10.000   -10.000
 -897.500    10.000   -10.000
 -897.500   -10.000   -10.000
  897.500   -10.000    10.000
  897.500    10.000    10.000
 -897.500    10.000    10.000
 -897.500   -10.000    10.000
-17.500 -71.749 0.000
1.0000000  0.0000000  0.0000000  0.0000000  1.0000000  0.0000000  0.0000000  0.0000000  1.0000000  
//----------------------------------------------------------
T17S2
T17I
17.500 -51.249 0.000
1.0000000  0.0000000  0.0000000  0.0000000  1.0000000  0.0000000  0.0000000  0.0000000  1.0000000  
//----------------------------------------------------------
T17S3
T17I
-17.500 -30.750 0.000
1.0000000  0.0000000  0.0000000  0.0000000  1.0000000  0.0000000  0.0000000  0.0000000  1.0000000  
//----------------------------------------------------------
T17S4
T17I
17.500 -10.250 0.000
1.0000000  0.0000000  0.0000000  0.0000000  1.0000000  0.0000000  0.0000000  0.0000000  1.0000000  
//----------------------------------------------------------
T17S5
T17I
-17.500 10.250 0.000
1.0000000  0.0000000  0.0000000  0.0000000  1.0000000  0.0000000  0.0000000  0.0000000  1.0000000  
//----------------------------------------------------------
T17S6
T17I
17.500 30.750 0.000
1.0000000  0.0000000  0.0000000  0.0000000  1.0000000  0.0000000  0.0000000  0.0000000  1.0000000  
//----------------------------------------------------------
T17S7
T17I
-17.500 51.249 0.000
1.0000000  0.0000000  0.0000000  0.0000000  1.0000000  0.0000000  0.0000000  0.0000000  1.0000000  
//----------------------------------------------------------
T17S8
T17I
17.500 71.749 0.000
1.0000000  0.0000000  0.0000000  0.0000000  1.0000000  0.0000000  0.0000000  0.0000000  1.0000000  
//----------------------------------------------------------
T18F1
SEC1
BOX 
CARBONFIBRE$
  987.500   -83.000   -11.250
  987.500    83.000   -11.250
 -987.500    83.000   -11.250
 -987.500   -83.000   -11.250
  987.500   -83.000    11.250
  987.500    83.000    11.250
 -987.500    83.000    11.250
 -987.500   -83.000    11.250
0.000 1857.711 1111.817
1.0000000  0.0000000  0.0000000  0.0000000  0.5135413  0.8580649  0.0000000  -0.8580649  0.5135413  
//----------------------------------------------------------
T18I
T18F1
BOX 
INSULATOR_TOF$
  987.500   -82.000   -10.250
  987.500    82.000   -10.250
 -987.500    82.000   -10.250
 -987.500   -82.000   -10.250
  987.500   -82.000    10.250
  987.500    82.000    10.250
 -987.500    82.000    10.250
 -987.500   -82.000    10.250
0.000 0.000 0.000
1.0000000  0.0000000  0.0000000  0.0000000  1.0000000  0.0000000  0.0000000  0.0000000  1.0000000  
//----------------------------------------------------------
T18S1
T18I
BOX 
SCINTILLATOR$
  970.000   -10.000   -10.000
  970.000    10.000   -10.000
 -970.000    10.000   -10.000
 -970.000   -10.000   -10.000
  970.000   -10.000    10.000
  970.000    10.000    10.000
 -970.000    10.000    10.000
 -970.000   -10.000    10.000
-17.500 -71.749 0.000
1.0000000  0.0000000  0.0000000  0.0000000  1.0000000  0.0000000  0.0000000  0.0000000  1.0000000  
//----------------------------------------------------------
T18S2
T18I
17.500 -51.250 0.000
1.0000000  0.0000000  0.0000000  0.0000000  1.0000000  0.0000000  0.0000000  0.0000000  1.0000000  
//----------------------------------------------------------
T18S3
T18I
-17.500 -30.750 0.000
1.0000000  0.0000000  0.0000000  0.0000000  1.0000000  0.0000000  0.0000000  0.0000000  1.0000000  
//----------------------------------------------------------
T18S4
T18I
17.500 -10.250 0.000
1.0000000  0.0000000  0.0000000  0.0000000  1.0000000  0.0000000  0.0000000  0.0000000  1.0000000  
//----------------------------------------------------------
T18S5
T18I
-17.500 10.250 0.000
1.0000000  0.0000000  0.0000000  0.0000000  1.0000000  0.0000000  0.0000000  0.0000000  1.0000000  
//----------------------------------------------------------
T18S6
T18I
17.500 30.750 0.000
1.0000000  0.0000000  0.0000000  0.0000000  1.0000000  0.0000000  0.0000000  0.0000000  1.0000000  
//----------------------------------------------------------
T18S7
T18I
-17.500 51.250 0.000
1.0000000  0.0000000  0.0000000  0.0000000  1.0000000  0.0000000  0.0000000  0.0000000  1.0000000  
//----------------------------------------------------------
T18S8
T18I
17.500 71.749 0.000
1.0000000  0.0000000  0.0000000  0.0000000  1.0000000  0.0000000  0.0000000  0.0000000  1.0000000  
//----------------------------------------------------------
T19F1
SEC1
BOX 
CARBONFIBRE$
 1002.500  -123.000   -16.250
 1002.500   123.000   -16.250
-1002.500   123.000   -16.250
-1002.500  -123.000   -16.250
 1002.500  -123.000    16.250
 1002.500   123.000    16.250
-1002.500   123.000    16.250
-1002.500  -123.000    16.250
0.000 1924.104 913.632
1.0000000  0.0000000  0.0000000  0.0000000  0.4289351  0.9033353  0.0000000  -0.9033353  0.4289351  
//----------------------------------------------------------
T19I
T19F1
BOX 
INSULATOR_TOF$
 1002.500  -122.000   -15.250
 1002.500   122.000   -15.250
-1002.500   122.000   -15.250
-1002.500  -122.000   -15.250
 1002.500  -122.000    15.250
 1002.500   122.000    15.250
-1002.500   122.000    15.250
-1002.500  -122.000    15.250
0.000 0.000 0.000
1.0000000  0.0000000  0.0000000  0.0000000  1.0000000  0.0000000  0.0000000  0.0000000  1.0000000  
//----------------------------------------------------------
T19S1
T19I
BOX 
SCINTILLATOR$
  985.000   -15.000   -15.000
  985.000    15.000   -15.000
 -985.000    15.000   -15.000
 -985.000   -15.000   -15.000
  985.000   -15.000    15.000
  985.000    15.000    15.000
 -985.000    15.000    15.000
 -985.000   -15.000    15.000
-12.500 -106.751 0.000
1.0000000  0.0000000  0.0000000  0.0000000  1.0000000  0.0000000  0.0000000  0.0000000  1.0000000  
//----------------------------------------------------------
T19S2
T19I
12.500 -76.251 0.000
1.0000000  0.0000000  0.0000000  0.0000000  1.0000000  0.0000000  0.0000000  0.0000000  1.0000000  
//----------------------------------------------------------
T19S3
T19I
-12.500 -45.751 0.000
1.0000000  0.0000000  0.0000000  0.0000000  1.0000000  0.0000000  0.0000000  0.0000000  1.0000000  
//----------------------------------------------------------
T19S4
T19I
12.500 -15.250 0.000
1.0000000  0.0000000  0.0000000  0.0000000  1.0000000  0.0000000  0.0000000  0.0000000  1.0000000  
//----------------------------------------------------------
T19S5
T19I
-12.500 15.250 0.000
1.0000000  0.0000000  0.0000000  0.0000000  1.0000000  0.0000000  0.0000000  0.0000000  1.0000000  
//----------------------------------------------------------
T19S6
T19I
12.500 45.751 0.000
1.0000000  0.0000000  0.0000000  0.0000000  1.0000000  0.0000000  0.0000000  0.0000000  1.0000000  
//----------------------------------------------------------
T19S7
T19I
-12.500 76.251 0.000
1.0000000  0.0000000  0.0000000  0.0000000  1.0000000  0.0000000  0.0000000  0.0000000  1.0000000  
//----------------------------------------------------------
T19S8
T19I
12.500 106.751 0.000
1.0000000  0.0000000  0.0000000  0.0000000  1.0000000  0.0000000  0.0000000  0.0000000  1.0000000  
//----------------------------------------------------------
T20F1
SEC1
BOX 
CARBONFIBRE$
 1085.000  -123.000   -16.250
 1085.000   123.000   -16.250
-1085.000   123.000   -16.250
-1085.000  -123.000   -16.250
 1085.000  -123.000    16.250
 1085.000   123.000    16.250
-1085.000   123.000    16.250
-1085.000  -123.000    16.250
0.000 2048.599 700.335
1.0000000  0.0000000  0.0000000  0.0000000  0.3239174  0.9460854  0.0000000  -0.9460854  0.3239174  
//----------------------------------------------------------
T20I
T20F1
BOX 
INSULATOR_TOF$
 1085.000  -122.000   -15.250
 1085.000   122.000   -15.250
-1085.000   122.000   -15.250
-1085.000  -122.000   -15.250
 1085.000  -122.000    15.250
 1085.000   122.000    15.250
-1085.000   122.000    15.250
-1085.000  -122.000    15.250
0.000 0.000 0.000
1.0000000  0.0000000  0.0000000  0.0000000  1.0000000  0.0000000  0.0000000  0.0000000  1.0000000  
//----------------------------------------------------------
T20S1
T20I
BOX 
SCINTILLATOR$
 1067.500   -15.000   -15.000
 1067.500    15.000   -15.000
-1067.500    15.000   -15.000
-1067.500   -15.000   -15.000
 1067.500   -15.000    15.000
 1067.500    15.000    15.000
-1067.500    15.000    15.000
-1067.500   -15.000    15.000
-12.500 -106.751 0.000
1.0000000  0.0000000  0.0000000  0.0000000  1.0000000  0.0000000  0.0000000  0.0000000  1.0000000  
//----------------------------------------------------------
T20S2
T20I
12.500 -76.251 0.000
1.0000000  0.0000000  0.0000000  0.0000000  1.0000000  0.0000000  0.0000000  0.0000000  1.0000000  
//----------------------------------------------------------
T20S3
T20I
-12.500 -45.750 0.000
1.0000000  0.0000000  0.0000000  0.0000000  1.0000000  0.0000000  0.0000000  0.0000000  1.0000000  
//----------------------------------------------------------
T20S4
T20I
12.500 -15.250 0.000
1.0000000  0.0000000  0.0000000  0.0000000  1.0000000  0.0000000  0.0000000  0.0000000  1.0000000  
//----------------------------------------------------------
T20S5
T20I
-12.500 15.250 0.000
1.0000000  0.0000000  0.0000000  0.0000000  1.0000000  0.0000000  0.0000000  0.0000000  1.0000000  
//----------------------------------------------------------
T20S6
T20I
12.500 45.750 0.000
1.0000000  0.0000000  0.0000000  0.0000000  1.0000000  0.0000000  0.0000000  0.0000000  1.0000000  
//----------------------------------------------------------
T20S7
T20I
-12.500 76.251 0.000
1.0000000  0.0000000  0.0000000  0.0000000  1.0000000  0.0000000  0.0000000  0.0000000  1.0000000  
//----------------------------------------------------------
T20S8
T20I
12.500 106.751 0.000
1.0000000  0.0000000  0.0000000  0.0000000  1.0000000  0.0000000  0.0000000  0.0000000  1.0000000  
//----------------------------------------------------------
T21F1
SEC1
BOX 
CARBONFIBRE$
 1150.000  -123.000   -16.250
 1150.000   123.000   -16.250
-1150.000   123.000   -16.250
-1150.000  -123.000   -16.250
 1150.000  -123.000    16.250
 1150.000   123.000    16.250
-1150.000   123.000    16.250
-1150.000  -123.000    16.250
0.000 2149.108 470.465
1.0000000  0.0000000  0.0000000  0.0000000  0.2147353  0.9766723  0.0000000  -0.9766723  0.2147353  
//----------------------------------------------------------
T21I
T21F1
BOX 
INSULATOR_TOF$
 1150.000  -122.000   -15.250
 1150.000   122.000   -15.250
-1150.000   122.000   -15.250
-1150.000  -122.000   -15.250
 1150.000  -122.000    15.250
 1150.000   122.000    15.250
-1150.000   122.000    15.250
-1150.000  -122.000    15.250
0.000 0.000 0.000
1.0000000  0.0000000  0.0000000  0.0000000  1.0000000  0.0000000  0.0000000  0.0000000  1.0000000  
//----------------------------------------------------------
T21S1
T21I
BOX 
SCINTILLATOR$
 1132.500   -15.000   -15.000
 1132.500    15.000   -15.000
-1132.500    15.000   -15.000
-1132.500   -15.000   -15.000
 1132.500   -15.000    15.000
 1132.500    15.000    15.000
-1132.500    15.000    15.000
-1132.500   -15.000    15.000
-12.500 -106.750 0.000
1.0000000  0.0000000  0.0000000  0.0000000  1.0000000  0.0000000  0.0000000  0.0000000  1.0000000  
//----------------------------------------------------------
T21S2
T21I
12.500 -76.250 0.000
1.0000000  0.0000000  0.0000000  0.0000000  1.0000000  0.0000000  0.0000000  0.0000000  1.0000000  
//----------------------------------------------------------
T21S3
T21I
-12.500 -45.750 0.000
1.0000000  0.0000000  0.0000000  0.0000000  1.0000000  0.0000000  0.0000000  0.0000000  1.0000000  
//----------------------------------------------------------
T21S4
T21I
12.500 -15.250 0.000
1.0000000  0.0000000  0.0000000  0.0000000  1.0000000  0.0000000  0.0000000  0.0000000  1.0000000  
//----------------------------------------------------------
T21S5
T21I
-12.500 15.250 0.000
1.0000000  0.0000000  0.0000000  0.0000000  1.0000000  0.0000000  0.0000000  0.0000000  1.0000000  
//----------------------------------------------------------
T21S6
T21I
12.500 45.750 0.000
1.0000000  0.0000000  0.0000000  0.0000000  1.0000000  0.0000000  0.0000000  0.0000000  1.0000000  
//----------------------------------------------------------
T21S7
T21I
-12.500 76.250 0.000
1.0000000  0.0000000  0.0000000  0.0000000  1.0000000  0.0000000  0.0000000  0.0000000  1.0000000  
//----------------------------------------------------------
T21S8
T21I
12.500 106.750 0.000
1.0000000  0.0000000  0.0000000  0.0000000  1.0000000  0.0000000  0.0000000  0.0000000  1.0000000  
//----------------------------------------------------------
T22F1
SEC1
BOX 
CARBONFIBRE$
 1200.000  -123.000   -16.250
 1200.000   123.000   -16.250
-1200.000   123.000   -16.250
-1200.000  -123.000   -16.250
 1200.000  -123.000    16.250
 1200.000   123.000    16.250
-1200.000   123.000    16.250
-1200.000  -123.000    16.250
0.000 2222.664 234.517
1.0000000  0.0000000  0.0000000  0.0000000  0.1062641  0.9943379  0.0000000  -0.9943379  0.1062641  
//----------------------------------------------------------
T22I
T22F1
BOX 
INSULATOR_TOF$
 1200.000  -122.000   -15.250
 1200.000   122.000   -15.250
-1200.000   122.000   -15.250
-1200.000  -122.000   -15.250
 1200.000  -122.000    15.250
 1200.000   122.000    15.250
-1200.000   122.000    15.250
-1200.000  -122.000    15.250
0.000 0.000 0.000
1.0000000  0.0000000  0.0000000  0.0000000  1.0000000  0.0000000  0.0000000  0.0000000  1.0000000  
//----------------------------------------------------------
T22S1
T22I
BOX 
SCINTILLATOR$
 1182.500   -15.000   -15.000
 1182.500    15.000   -15.000
-1182.500    15.000   -15.000
-1182.500   -15.000   -15.000
 1182.500   -15.000    15.000
 1182.500    15.000    15.000
-1182.500    15.000    15.000
-1182.500   -15.000    15.000
-12.500 -106.750 0.000
1.0000000  0.0000000  0.0000000  0.0000000  1.0000000  0.0000000  0.0000000  0.0000000  1.0000000  
//----------------------------------------------------------
T22S2
T22I
12.500 -76.250 0.000
1.0000000  0.0000000  0.0000000  0.0000000  1.0000000  0.0000000  0.0000000  0.0000000  1.0000000  
//----------------------------------------------------------
T22S3
T22I
-12.500 -45.750 0.000
1.0000000  0.0000000  0.0000000  0.0000000  1.0000000  0.0000000  0.0000000  0.0000000  1.0000000  
//----------------------------------------------------------
T22S5
T22I
-12.500 15.250 0.000
1.0000000  0.0000000  0.0000000  0.0000000  1.0000000  0.0000000  0.0000000  0.0000000  1.0000000  
//----------------------------------------------------------
T22S7
T22I
-12.500 76.250 0.000
1.0000000  0.0000000  0.0000000  0.0000000  1.0000000  0.0000000  0.0000000  0.0000000  1.0000000  
//----------------------------------------------------------
T22S8
T22I
12.500 106.750 0.000
1.0000000  0.0000000  0.0000000  0.0000000  1.0000000  0.0000000  0.0000000  0.0000000  1.0000000  
//----------------------------------------------------------
T22S6
T22I
12.500 45.750 0.000
1.0000000  0.0000000  0.0000000  0.0000000  1.0000000  0.0000000  0.0000000  0.0000000  1.0000000  
//----------------------------------------------------------
T22S4
T22I
12.500 -15.250 0.000
1.0000000  0.0000000  0.0000000  0.0000000  1.0000000  0.0000000  0.0000000  0.0000000  1.0000000  
//----------------------------------------------------------
T15F2
SEC2
0.000 1481.325 1453.070
1.0000000  0.0000000  -0.0000000  0.0000000  0.6971651  0.7169106  0.0000000  -0.7169106  0.6971651  
//----------------------------------------------------------
T16F2
SEC2
0.001 1615.753 1349.222
1.0000000  0.0000000  -0.0000000  0.0000000  0.6387678  0.7693996  0.0000000  -0.7693996  0.6387678  
//----------------------------------------------------------
T17F2
SEC2
0.000 1742.875 1233.134
1.0000000  0.0000000  0.0000001  0.0000000  0.5764323  0.8171449  0.0000000  -0.8171449  0.5764323  
//----------------------------------------------------------
T18F2
SEC2
0.000 1857.711 1111.817
1.0000000  0.0000000  0.0000000  0.0000000  0.5135413  0.8580649  0.0000000  -0.8580649  0.5135413  
//----------------------------------------------------------
T19F2
SEC2
-0.000 1924.104 913.632
1.0000000  0.0000000  0.0000001  0.0000000  0.4289351  0.9033353  0.0000000  -0.9033353  0.4289351  
//----------------------------------------------------------
T20F2
SEC2
0.000 2048.599 700.335
1.0000000  -0.0000000  -0.0000000  0.0000000  0.3239174  0.9460854  0.0000000  -0.9460854  0.3239174  
//----------------------------------------------------------
T21F2
SEC2
0.000 2149.108 470.465
1.0000000  0.0000001  0.0000001  0.0000000  0.2147353  0.9766723  0.0000000  -0.9766723  0.2147353  
//----------------------------------------------------------
T22F2
SEC2
0.000 2222.664 234.517
1.0000000  0.0000000  0.0000000  0.0000000  0.1062641  0.9943379  0.0000000  -0.9943379  0.1062641  
//----------------------------------------------------------
T15F3
SEC3
-0.000 1481.325 1453.070
1.0000000  -0.0000000  0.0000000  0.0000000  0.6971651  0.7169106  0.0000000  -0.7169106  0.6971651  
//----------------------------------------------------------
T16F3
SEC3
-0.001 1615.753 1349.222
1.0000000  -0.0000000  0.0000000  0.0000000  0.6387678  0.7693996  0.0000000  -0.7693996  0.6387678  
//----------------------------------------------------------
T17F3
SEC3
-0.000 1742.875 1233.134
1.0000000  -0.0000000  -0.0000001  0.0000000  0.5764323  0.8171449  0.0000000  -0.8171449  0.5764323  
//----------------------------------------------------------
T18F3
SEC3
-0.000 1857.711 1111.817
1.0000000  -0.0000000  -0.0000000  0.0000000  0.5135413  0.8580649  0.0000000  -0.8580649  0.5135413  
//----------------------------------------------------------
T19F3
SEC3
0.000 1924.104 913.632
1.0000000  -0.0000000  -0.0000001  0.0000000  0.4289351  0.9033353  0.0000000  -0.9033353  0.4289351  
//----------------------------------------------------------
T20F3
SEC3
-0.000 2048.599 700.335
1.0000000  0.0000000  0.0000000  0.0000000  0.3239174  0.9460854  0.0000000  -0.9460854  0.3239174  
//----------------------------------------------------------
T21F3
SEC3
-0.000 2149.108 470.465
1.0000000  -0.0000001  -0.0000001  0.0000000  0.2147353  0.9766723  0.0000000  -0.9766723  0.2147353  
//----------------------------------------------------------
T22F3
SEC3
-0.000 2222.664 234.517
1.0000000  -0.0000000  -0.0000000  0.0000000  0.1062641  0.9943379  0.0000000  -0.9943379  0.1062641  
//----------------------------------------------------------
T15F4
SEC4
0.000 1481.325 1453.070
1.0000000  0.0000000  0.0000000  0.0000000  0.6971651  0.7169106  0.0000000  -0.7169106  0.6971651  
//----------------------------------------------------------
T16F4
SEC4
0.000 1615.753 1349.222
1.0000000  0.0000000  0.0000000  0.0000000  0.6387678  0.7693996  0.0000000  -0.7693996  0.6387678  
//----------------------------------------------------------
T17F4
SEC4
0.000 1742.875 1233.134
1.0000000  0.0000000  0.0000000  0.0000000  0.5764323  0.8171449  0.0000000  -0.8171449  0.5764323  
//----------------------------------------------------------
T18F4
SEC4
0.000 1857.711 1111.817
1.0000000  0.0000000  0.0000000  0.0000000  0.5135413  0.8580649  0.0000000  -0.8580649  0.5135413  
//----------------------------------------------------------
T19F4
SEC4
0.000 1924.104 913.632
1.0000000  0.0000000  0.0000000  0.0000000  0.4289351  0.9033353  0.0000000  -0.9033353  0.4289351  
//----------------------------------------------------------
T20F4
SEC4
0.000 2048.599 700.335
1.0000000  0.0000000  0.0000000  0.0000000  0.3239174  0.9460854  0.0000000  -0.9460854  0.3239174  
//----------------------------------------------------------
T21F4
SEC4
0.000 2149.108 470.465
1.0000000  0.0000000  0.0000000  0.0000000  0.2147353  0.9766723  0.0000000  -0.9766723  0.2147353  
//----------------------------------------------------------
T22F4
SEC4
0.000 2222.664 234.517
1.0000000  0.0000000  0.0000000  0.0000000  0.1062641  0.9943379  0.0000000  -0.9943379  0.1062641  
//----------------------------------------------------------
T15F5
SEC5
0.000 1481.325 1453.070
1.0000000  0.0000000  -0.0000000  0.0000000  0.6971651  0.7169106  0.0000000  -0.7169106  0.6971651  
//----------------------------------------------------------
T16F5
SEC5
0.001 1615.753 1349.222
1.0000000  0.0000000  -0.0000000  0.0000000  0.6387678  0.7693996  0.0000000  -0.7693996  0.6387678  
//----------------------------------------------------------
T17F5
SEC5
0.000 1742.875 1233.134
1.0000000  0.0000000  0.0000001  0.0000000  0.5764323  0.8171449  0.0000000  -0.8171449  0.5764323  
//----------------------------------------------------------
T18F5
SEC5
0.000 1857.711 1111.817
1.0000000  0.0000000  0.0000000  0.0000000  0.5135413  0.8580649  0.0000000  -0.8580649  0.5135413  
//----------------------------------------------------------
T19F5
SEC5
-0.000 1924.104 913.632
1.0000000  0.0000000  0.0000001  0.0000000  0.4289351  0.9033353  0.0000000  -0.9033353  0.4289351  
//----------------------------------------------------------
T20F5
SEC5
0.000 2048.599 700.335
1.0000000  -0.0000000  -0.0000000  0.0000000  0.3239174  0.9460854  0.0000000  -0.9460854  0.3239174  
//----------------------------------------------------------
T21F5
SEC5
0.000 2149.108 470.465
1.0000000  0.0000001  0.0000001  0.0000000  0.2147353  0.9766723  0.0000000  -0.9766723  0.2147353  
//----------------------------------------------------------
T22F5
SEC5
0.000 2222.664 234.517
1.0000000  0.0000000  0.0000000  0.0000000  0.1062641  0.9943379  0.0000000  -0.9943379  0.1062641  
//----------------------------------------------------------
T15F6
SEC6
-0.000 1481.325 1453.070
1.0000000  -0.0000000  0.0000000  0.0000000  0.6971651  0.7169106  0.0000000  -0.7169106  0.6971651  
//----------------------------------------------------------
T16F6
SEC6
-0.001 1615.753 1349.222
1.0000000  -0.0000000  0.0000000  0.0000000  0.6387678  0.7693996  0.0000000  -0.7693996  0.6387678  
//----------------------------------------------------------
T17F6
SEC6
-0.000 1742.875 1233.134
1.0000000  -0.0000000  -0.0000001  0.0000000  0.5764323  0.8171449  0.0000000  -0.8171449  0.5764323  
//----------------------------------------------------------
T18F6
SEC6
-0.000 1857.711 1111.817
1.0000000  -0.0000000  -0.0000000  0.0000000  0.5135413  0.8580649  0.0000000  -0.8580649  0.5135413  
//----------------------------------------------------------
T19F6
SEC6
0.000 1924.104 913.632
1.0000000  -0.0000000  -0.0000001  0.0000000  0.4289351  0.9033353  0.0000000  -0.9033353  0.4289351  
//----------------------------------------------------------
T20F6
SEC6
-0.000 2048.599 700.335
1.0000000  0.0000000  0.0000000  0.0000000  0.3239174  0.9460854  0.0000000  -0.9460854  0.3239174  
//----------------------------------------------------------
T21F6
SEC6
-0.000 2149.108 470.465
1.0000000  -0.0000001  -0.0000001  0.0000000  0.2147353  0.9766723  0.0000000  -0.9766723  0.2147353  
//----------------------------------------------------------
T22F6
SEC6
-0.000 2222.664 234.517
1.0000000  -0.0000000  -0.0000000  0.0000000  0.1062641  0.9943379  0.0000000  -0.9943379  0.1062641  
//----------------------------------------------------------
