//----------------------------------------------------------
RICH
CAVE
PGON
AIR$
  3
    0.000   360.000     6.000
    0.000     0.000   790.000
  380.729     0.000   790.000
  962.000     0.000   192.203
0.000 0.000 -440.000
1.0000000  0.0000000  0.0000000  0.0000000  1.0000000  0.0000000  0.0000000  0.0000000  1.0000000  
//----------------------------------------------------------
RMET
RICH
PCON
METHAN$
    4.000     0.000     0.000
    0.000   360.000     0.000
    0.000   660.000   770.000
   22.978   660.000   770.000
  247.000    44.500   770.000
  371.500    44.500   770.000
0.000 0.000 0.000
1.0000000  0.0000000  0.0000000  0.0000000  1.0000000  0.0000000  0.0000000  0.0000000  1.0000000  
//----------------------------------------------------------
RFA1
RMET
PCON
ALUMINIUM$
    4.000     0.000     0.000
    0.000   360.000     0.000
    0.000   660.000   770.000
   20.000   660.000   770.000
   20.000   740.000   770.000
  370.000   740.000   770.000
0.000 0.000 0.000
1.0000000  0.0000000  0.0000000  0.0000000  1.0000000  0.0000000  0.0000000  0.0000000  1.0000000  
//----------------------------------------------------------
RFI1
RFA1
TUBE
AIR$
    0.000     0.000   215.000
  740.000   770.000
    0.000     0.000   290.000
0.000 0.000 0.000
1.0000000  0.0000000  0.0000000  0.0000000  1.0000000  0.0000000  0.0000000  0.0000000  1.0000000  
//----------------------------------------------------------
RFA2
RMET
PCON
ALUMINIUM$
    4.000     0.000     0.000
    0.000   360.000     0.000
  175.000   690.000   740.000
  313.000   690.000   740.000
  313.000   705.000   740.000
  370.000   705.000   740.000
0.000 0.000 0.000
1.0000000  0.0000000  0.0000000  0.0000000  1.0000000  0.0000000  0.0000000  0.0000000  1.0000000  
//----------------------------------------------------------
RRIB1
RMET
TRAP
STEEL$
   12.500    34.000     0.000
   12.500   109.000     0.000
  -12.500   109.000     0.000
  -12.500    34.000     0.000
   12.500     0.000   605.386
   12.500    17.000   605.386
  -12.500    17.000   605.386
  -12.500     0.000   605.386
689.886 0.000 347.000
0.0000000  0.0000000  -1.0000000  1.0000000  0.0000000  0.0000000  0.0000000  -1.0000000  0.0000000  
//----------------------------------------------------------
RRIB2
RMET
344.943 -597.459 347.000
0.8660250  0.0000000  -0.5000000  0.5000000  0.0000000  0.8660250  0.0000000  -1.0000000  0.0000000  
//----------------------------------------------------------
RRIB3
RMET
-344.943 -597.459 347.000
0.8660250  0.0000000  0.5000000  -0.5000000  0.0000000  0.8660250  0.0000000  -1.0000000  0.0000000  
//----------------------------------------------------------
RRIB4
RMET
-689.886 0.000 347.000
0.0000000  0.0000000  1.0000000  -1.0000000  0.0000000  0.0000000  0.0000000  -1.0000000  0.0000000  
//----------------------------------------------------------
RRIB5
RMET
-344.943 597.459 347.000
-0.8660250  0.0000000  0.5000000  -0.5000000  0.0000000  -0.8660250  0.0000000  -1.0000000  0.0000000  
//----------------------------------------------------------
RRIB6
RMET
344.943 597.459 347.000
-0.8660250  0.0000000  -0.5000000  0.5000000  0.0000000  -0.8660250  0.0000000  -1.0000000  0.0000000  
//----------------------------------------------------------
RPAS1
RMET
PGON
METHAN$
  2
  -28.390    56.780     4.000
   32.500    47.612   708.521
   64.000    36.351   708.521
-9.720 -5.612 267.282
0.8137980  -0.5000000  0.2961980  0.4698460  0.8660250  0.1710100  -0.3420200  0.0000000  0.9396930  
//----------------------------------------------------------
RPKA
RPAS1
PGON
STEEL$
  2
  -28.390    56.780     4.000
   32.500    47.612   708.521
   64.000    36.351   708.521
0.000 0.000 0.000
1.0000000  0.0000000  0.0000000  0.0000000  1.0000000  0.0000000  0.0000000  0.0000000  1.0000000  
//----------------------------------------------------------
RPKB
RPKA
PGON
METHAN$
  2
  -28.000    56.000     4.000
   32.500    76.465   658.100
   64.000    65.000   658.100
3.347 0.000 -0.000
1.0000000  0.0000000  0.0000000  0.0000000  1.0000000  0.0000000  0.0000000  0.0000000  1.0000000  
//----------------------------------------------------------
RPKC
RPKB
PGON
ALUMINIUM$
  2
  -28.000    56.000     4.000
   32.500    76.465   619.300
   64.000    65.000   619.300
1.797 -0.002 0.001
1.0000000  0.0000000  0.0000000  0.0000000  1.0000000  0.0000000  0.0000000  0.0000000  1.0000000  
//----------------------------------------------------------
RPKD
RPKC
PGON
AIR$
  2
  -28.000    56.000     4.000
   32.500    65.000   581.300
   57.250    65.000   581.300
24.500 0.001 -0.002
1.0000000  0.0000000  0.0000000  0.0000000  1.0000000  0.0000000  0.0000000  0.0000000  1.0000000  
//----------------------------------------------------------
RSTE
RPKC
PGON
STESALITH$
  2
  -28.000    56.000     4.000
   64.000    65.000   619.300
   62.250    65.637   619.300
0.000 0.000 0.000
1.0000000  0.0000000  0.0000000  0.0000000  1.0000000  0.0000000  0.0000000  0.0000000  1.0000000  
//----------------------------------------------------------
RPAS2
RMET
0.000 -11.223 267.282
0.0000000  -1.0000000  0.0000000  0.9396930  0.0000000  0.3420200  -0.3420200  0.0000000  0.9396930  
//----------------------------------------------------------
RPAS3
RMET
9.720 -5.612 267.282
-0.8137980  -0.5000000  -0.2961980  0.4698460  -0.8660250  0.1710100  -0.3420200  0.0000000  0.9396930  
//----------------------------------------------------------
RPAS4
RMET
9.720 5.612 267.282
-0.8137980  0.5000000  -0.2961980  -0.4698460  -0.8660250  -0.1710100  -0.3420200  0.0000000  0.9396930  
//----------------------------------------------------------
RPAS5
RMET
0.000 11.223 267.282
0.0000000  1.0000000  0.0000000  -0.9396930  0.0000000  -0.3420200  -0.3420200  0.0000000  0.9396930  
//----------------------------------------------------------
RPAS6
RMET
-9.720 5.612 267.282
0.8137980  0.5000000  0.2961980  -0.4698460  0.8660250  -0.1710100  -0.3420200  0.0000000  0.9396930  
//----------------------------------------------------------
RDET6
RMET
PGON
RICHPHOTDET$
  2
  -28.000    56.000     4.000
    0.000    65.000   619.300
    5.500    65.000   619.300
11.520 6.651 326.462
0.8137980  -0.5000000  0.2961980  0.4698460  0.8660250  0.1710100  -0.3420200  0.0000000  0.9396930  
//----------------------------------------------------------
RDET1
RMET
0.000 13.302 326.462
0.0000000  -1.0000000  0.0000000  0.9396930  0.0000000  0.3420200  -0.3420200  0.0000000  0.9396930  
//----------------------------------------------------------
RPAD
RDET1
PGON
RICHPADS$
  2
  -28.000    56.000     4.000
    0.000    65.000   619.300
    0.050    65.000   619.300
0.000 0.000 0.000
1.0000000  0.0000000  0.0000000  0.0000000  1.0000000  0.0000000  0.0000000  0.0000000  1.0000000  
//----------------------------------------------------------
RDET2
RMET
-11.520 6.651 326.462
-0.8137980  -0.5000000  -0.2961980  0.4698460  -0.8660250  0.1710100  -0.3420200  0.0000000  0.9396930  
//----------------------------------------------------------
RDET3
RMET
-11.520 -6.651 326.462
-0.8137980  0.5000000  -0.2961980  -0.4698460  -0.8660250  -0.1710100  -0.3420200  0.0000000  0.9396930  
//----------------------------------------------------------
RDET4
RMET
0.000 -13.302 326.462
0.0000000  1.0000000  0.0000000  -0.9396930  0.0000000  -0.3420200  -0.3420200  0.0000000  0.9396930  
//----------------------------------------------------------
RDET5
RMET
11.520 -6.651 326.462
0.8137980  0.5000000  0.2961980  -0.4698460  0.8660250  -0.1710100  -0.3420200  0.0000000  0.9396930  
//----------------------------------------------------------
RPBS1
RMET
PGON
ALUMINIUM$
  2
  -28.480    56.960     4.000
   12.500    47.040   700.669
   32.500    39.761   700.669
-3.445 -1.989 264.645
0.8137980  -0.5000000  0.2961980  0.4698460  0.8660250  0.1710100  -0.3420200  0.0000000  0.9396930  
//----------------------------------------------------------
RPLA
RPBS1
PGON
AIR$
  2
  -28.000    56.000     4.000
   12.500    37.979   545.000
   32.500    30.700   545.000
54.060 0.000 -0.000
1.0000000  0.0000000  0.0000000  0.0000000  1.0000000  0.0000000  0.0000000  0.0000000  1.0000000  
//----------------------------------------------------------
RPLB
RPLA
TRAP
STEEL$
   10.000  -116.551     0.000
   10.000   116.551     0.000
  -10.000   116.551     0.000
  -10.000  -116.551     0.000
   10.000  -131.439    28.000
   10.000   131.439    28.000
  -10.000   131.439    28.000
  -10.000  -131.439    28.000
219.199 -0.000 22.503
0.0000005  -0.0000030  1.0000006  0.0000003  0.9999965  -0.0000031  -1.0000030  -0.0000005  -0.0000005  
//----------------------------------------------------------
RPLC
RPLA
BOX 
STEEL$
  300.100   -14.000    12.500
  300.100    14.000    12.500
    0.000    14.000    12.500
    0.000   -14.000    12.500
  300.100   -14.000    32.500
  300.100    14.000    32.500
    0.000    14.000    32.500
    0.000   -14.000    32.500
247.200 -0.000 0.000
1.0000000  0.0000000  0.0000000  0.0000000  1.0000000  0.0000000  0.0000000  0.0000000  1.0000000  
//----------------------------------------------------------
RPBS2
RMET
0.000 -3.978 264.645
0.0000000  -1.0000000  0.0000000  0.9396930  0.0000000  0.3420200  -0.3420200  0.0000000  0.9396930  
//----------------------------------------------------------
RPBS3
RMET
3.445 -1.989 264.645
-0.8137980  -0.5000000  -0.2961980  0.4698460  -0.8660250  0.1710100  -0.3420200  0.0000000  0.9396930  
//----------------------------------------------------------
RPBS4
RMET
3.445 1.989 264.645
-0.8137980  0.5000000  -0.2961980  -0.4698460  -0.8660250  -0.1710100  -0.3420200  0.0000000  0.9396930  
//----------------------------------------------------------
RPBS5
RMET
0.000 3.978 264.645
0.0000000  1.0000000  0.0000000  -0.9396930  0.0000000  -0.3420200  -0.3420200  0.0000000  0.9396930  
//----------------------------------------------------------
RPBS6
RMET
-3.445 1.989 264.645
0.8137980  0.5000000  0.2961980  -0.4698460  0.8660250  -0.1710100  -0.3420200  0.0000000  0.9396930  
//----------------------------------------------------------
RPCS1
RMET
PGON
AIR$
  2
  -28.480    56.960     4.000
    0.000    47.356   696.436
   12.500    42.806   696.436
0.000 0.000 263.197
0.8137980  -0.5000000  0.2961980  0.4698460  0.8660250  0.1710100  -0.3420200  0.0000000  0.9396930  
//----------------------------------------------------------
RPS1
RPCS1
TRAP
ALUMINIUM$
   20.000    47.766     0.000
   40.000   696.072     0.000
    0.000   696.072     0.000
    0.000    47.356     0.000
   20.000    47.766    12.500
   40.000   696.072    12.500
    0.000   696.072    12.500
    0.000    47.356    12.500
0.000 0.000 0.000
0.4756270  0.8796470  -0.0000005  -0.8796464  0.4756198  -0.0000003  0.0000001  -0.0000006  1.0000030  
//----------------------------------------------------------
RPS2
RPCS1
TRAP
ALUMINIUM$
    0.000    47.766     0.000
    0.000   696.072     0.000
  -40.000   696.072     0.000
  -20.000    47.356     0.000
    0.000    47.766    12.500
    0.000   696.072    12.500
  -40.000   696.072    12.500
  -20.000    47.356    12.500
0.000 0.000 0.000
-0.4756215  0.8796500  -0.0000005  -0.8796435  -0.4756250  -0.0000003  0.0000004  -0.0000002  1.0000030  
//----------------------------------------------------------
RPCB
RPCS1
PGON
STESALITH$
  2
  -26.000    52.000     4.000
    0.000     7.600   653.500
    5.000     6.000   653.500
42.400 -0.000 -0.000
1.0000000  0.0000000  0.0000000  0.0000000  1.0000000  0.0000000  0.0000000  0.0000000  1.0000000  
//----------------------------------------------------------
RPCS2
RMET
0.000 0.000 263.197
0.0000000  -1.0000000  0.0000000  0.9396930  0.0000000  0.3420200  -0.3420200  0.0000000  0.9396930  
//----------------------------------------------------------
RPCS3
RMET
0.000 0.000 263.197
-0.8137980  -0.5000000  -0.2961980  0.4698460  -0.8660250  0.1710100  -0.3420200  0.0000000  0.9396930  
//----------------------------------------------------------
RPCS4
RMET
0.000 0.000 263.197
-0.8137980  0.5000000  -0.2961980  -0.4698460  -0.8660250  -0.1710100  -0.3420200  0.0000000  0.9396930  
//----------------------------------------------------------
RPCS5
RMET
0.000 0.000 263.197
0.0000000  1.0000000  0.0000000  -0.9396930  0.0000000  -0.3420200  -0.3420200  0.0000000  0.9396930  
//----------------------------------------------------------
RPCS6
RMET
0.000 0.000 263.197
0.8137980  0.5000000  0.2961980  -0.4698460  0.8660250  -0.1710100  -0.3420200  0.0000000  0.9396930  
//----------------------------------------------------------
RWIN1
RMET
TRAP
STEEL$
    5.000     0.000     0.000
    5.000    25.000     0.000
   -5.000    25.000     0.000
   -5.000     0.000     0.000
    5.000     0.000   620.482
    5.000    20.000   620.482
   -5.000    20.000   620.482
   -5.000     0.000   620.482
704.982 0.000 370.000
0.0000000  0.0000000  -1.0000000  1.0000000  0.0000000  0.0000000  0.0000000  -1.0000000  0.0000000  
//----------------------------------------------------------
RWIN2
RMET
352.491 -610.533 370.000
0.8660250  0.0000000  -0.5000000  0.5000000  0.0000000  0.8660250  0.0000000  -1.0000000  0.0000000  
//----------------------------------------------------------
RWIN3
RMET
-352.491 -610.533 370.000
0.8660250  0.0000000  0.5000000  -0.5000000  0.0000000  0.8660250  0.0000000  -1.0000000  0.0000000  
//----------------------------------------------------------
RWIN4
RMET
-704.982 0.000 370.000
0.0000000  0.0000000  1.0000000  -1.0000000  0.0000000  0.0000000  0.0000000  -1.0000000  0.0000000  
//----------------------------------------------------------
RWIN5
RMET
-352.491 610.533 370.000
-0.8660250  0.0000000  0.5000000  -0.5000000  0.0000000  -0.8660250  0.0000000  -1.0000000  0.0000000  
//----------------------------------------------------------
RWIN6
RMET
352.491 610.533 370.000
-0.8660250  0.0000000  -0.5000000  0.5000000  0.0000000  -0.8660250  0.0000000  -1.0000000  0.0000000  
//----------------------------------------------------------
RMS3
RMET
PCON
STEEL$
    4.000     0.000     0.000
    0.000   360.000     0.000
  117.500    44.500    60.000
  134.500    44.500    60.000
  134.500    58.000    60.000
  143.500    58.000    60.000
0.000 0.000 225.000
1.0000000  0.0000000  0.0000000  0.0000000  1.0000000  0.0000000  0.0000000  0.0000000  1.0000000  
//----------------------------------------------------------
RMS7
RMET
PCON
STEEL$
    2.000     0.000     0.000
    0.000   360.000     0.000
    0.000    44.500    57.000
   12.000    44.500    57.000
0.000 0.000 359.500
1.0000000  0.0000000  0.0000000  0.0000000  1.0000000  0.0000000  0.0000000  0.0000000  1.0000000  
//----------------------------------------------------------
RSPH
RICH
PCON
C4F10_2012$
   14.000     0.000     0.000
    0.000   360.000     0.000
  371.500    29.000   790.000
  379.000    29.000   790.000
  449.000    29.000   715.000
  449.000     0.000   711.242
  486.159     0.000   681.571
  608.907     0.000   555.334
  648.800     0.000   501.160
  687.400     0.000   439.034
  720.800     0.000   373.906
  748.700     0.000   306.380
  771.000     0.000   236.711
  787.500     0.000   165.518
  798.100     0.000    93.200
  801.800     0.000    47.000
0.000 0.000 0.000
1.0000000  0.0000000  0.0000000  0.0000000  1.0000000  0.0000000  0.0000000  0.0000000  1.0000000  
//----------------------------------------------------------
RFEN
RSPH
TUBE
CAF2$
    0.000     0.000    -2.500
   71.000   721.000
    0.000     0.000     2.500
0.000 0.000 374.000
1.0000000  0.0000000  0.0000000  0.0000000  1.0000000  0.0000000  0.0000000  0.0000000  1.0000000  
//----------------------------------------------------------
RWIU
RSPH
PCON
ALUMINIUM$
    4.000     0.000     0.000
    0.000   360.000     0.000
    0.000   722.000   732.000
    6.500   722.000   732.000
    6.500   707.000   732.000
   18.500   707.000   732.000
0.000 0.000 371.500
1.0000000  0.0000000  0.0000000  0.0000000  1.0000000  0.0000000  0.0000000  0.0000000  1.0000000  
//----------------------------------------------------------
RWIC1
RSPH
BOX 
STEEL$
  705.000    -5.000     0.000
  705.000     5.000     0.000
   84.000     5.000     0.000
   84.000    -5.000     0.000
  705.000    -5.000    12.000
  705.000     5.000    12.000
   84.000     5.000    12.000
   84.000    -5.000    12.000
0.000 0.000 378.000
1.0000000  0.0000000  0.0000000  0.0000000  1.0000000  0.0000000  0.0000000  0.0000000  1.0000000  
//----------------------------------------------------------
RWIC2
RSPH
0.000 0.000 378.000
0.5000000  0.8660250  0.0000000  -0.8660250  0.5000000  0.0000000  0.0000000  0.0000000  1.0000000  
//----------------------------------------------------------
RWIC3
RSPH
0.000 0.000 378.000
-0.5000000  0.8660250  0.0000000  -0.8660250  -0.5000000  0.0000000  0.0000000  0.0000000  1.0000000  
//----------------------------------------------------------
RWIC4
RSPH
0.000 0.000 378.000
-1.0000000  0.0000000  0.0000000  0.0000000  -1.0000000  0.0000000  0.0000000  0.0000000  1.0000000  
//----------------------------------------------------------
RWIC5
RSPH
0.000 0.000 378.000
-0.5000000  -0.8660250  0.0000000  0.8660250  -0.5000000  0.0000000  0.0000000  0.0000000  1.0000000  
//----------------------------------------------------------
RWIC6
RSPH
0.000 0.000 378.000
0.5000000  -0.8660250  0.0000000  0.8660250  0.5000000  0.0000000  0.0000000  0.0000000  1.0000000  
//----------------------------------------------------------
RBT2
RSPH
PCON
CARBON$
    3.000     0.000     0.000
    0.000   360.000     0.000
  449.000     0.000     9.354
  801.598     0.000    49.520
  801.800     0.000    47.000
0.000 0.000 0.000
1.0000000  0.0000000  0.0000000  0.0000000  1.0000000  0.0000000  0.0000000  0.0000000  1.0000000  
//----------------------------------------------------------
RBI2
RBT2
PCON
AIR_100MBAR$
    3.000     0.000     0.000
    0.000   360.000     0.000
    0.000     0.000     8.354
  352.678     0.000    48.529
  352.800     0.000    47.000
0.000 0.000 449.000
1.0000000  0.0000000  0.0000000  0.0000000  1.0000000  0.0000000  0.0000000  0.0000000  1.0000000  
//----------------------------------------------------------
RSS1
RSPH
PCON
STEEL$
    4.000     0.000     0.000
    0.000   360.000     0.000
    0.000    30.000    59.500
    8.000    30.000    59.500
    8.000    30.000    79.000
   20.000    30.000    79.000
0.000 0.000 371.500
1.0000000  0.0000000  0.0000000  0.0000000  1.0000000  0.0000000  0.0000000  0.0000000  1.0000000  
//----------------------------------------------------------
RMIP
RSPH
PCON
ALUMINIUM$
    4.000     0.000     0.000
    0.000   360.000     0.000
  371.500   770.000   790.000
  379.000   770.000   790.000
  379.000   786.000   790.000
  449.000   711.000   715.000
0.000 0.000 0.000
1.0000000  0.0000000  0.0000000  0.0000000  1.0000000  0.0000000  0.0000000  0.0000000  1.0000000  
//----------------------------------------------------------
RMIR
RSPH
SPHE
RICHMIRROR$
  871.000   873.000
    4.500    55.000
    0.000   360.000
0.000 0.000 -88.500
1.0000000  0.0000000  0.0000000  0.0000000  1.0000000  0.0000000  0.0000000  0.0000000  1.0000000  
//----------------------------------------------------------
RMR1
RSPH
TUBE
ALUMINIUM$
    0.000     0.000   781.808
   55.000    80.000
    0.000     0.000   791.800
0.000 0.000 0.000
1.0000000  0.0000000  0.0000000  0.0000000  1.0000000  0.0000000  0.0000000  0.0000000  1.0000000  
//----------------------------------------------------------
RMR2
RSPH
CONE
ALUMINIUM$
    0.000     0.000   395.000
  737.000   750.000
    0.000     0.000   410.500
  713.500   729.500
0.000 0.000 0.000
1.0000000  0.0000000  0.0000000  0.0000000  1.0000000  0.0000000  0.0000000  0.0000000  1.0000000  
//----------------------------------------------------------
RMR3
RSPH
TUBE
ALUMINIUM$
    0.000     0.000   371.500
  737.000   757.000
    0.000     0.000   395.000
0.000 0.000 0.000
1.0000000  0.0000000  0.0000000  0.0000000  1.0000000  0.0000000  0.0000000  0.0000000  1.0000000  
//----------------------------------------------------------
RMRS1
RSPH
TUBS
C4F10_2012$
    0.000     0.000   -25.000
  873.000   879.000
    0.000     0.000    25.000
    5.270    55.000
0.000 0.000 -88.500
0.0000000  1.0000000  0.0000000  0.0000000  0.0000000  1.0000000  1.0000000  0.0000000  0.0000000  
//----------------------------------------------------------
RM01
RMRS1
TUBS
ALUMINIUM$
    0.000     0.000   -15.000
  873.000   879.000
    0.000     0.000    15.000
    5.270     9.400
0.000 0.000 0.000
1.0000000  0.0000000  0.0000000  0.0000000  1.0000000  0.0000000  0.0000000  0.0000000  1.0000000  
//----------------------------------------------------------
RM02
RMRS1
TUBS
ALUMINIUM$
    0.000     0.000   -16.000
  873.000   879.000
    0.000     0.000    16.000
    9.400    13.300
0.000 0.000 0.000
1.0000000  0.0000000  0.0000000  0.0000000  1.0000000  0.0000000  0.0000000  0.0000000  1.0000000  
//----------------------------------------------------------
RM03
RMRS1
TUBS
ALUMINIUM$
    0.000     0.000   -17.000
  873.000   879.000
    0.000     0.000    17.000
   13.300    17.500
0.000 0.000 0.000
1.0000000  0.0000000  0.0000000  0.0000000  1.0000000  0.0000000  0.0000000  0.0000000  1.0000000  
//----------------------------------------------------------
RM04
RMRS1
TUBS
ALUMINIUM$
    0.000     0.000   -18.000
  873.000   879.000
    0.000     0.000    18.000
   17.500    21.700
0.000 0.000 0.000
1.0000000  0.0000000  0.0000000  0.0000000  1.0000000  0.0000000  0.0000000  0.0000000  1.0000000  
//----------------------------------------------------------
RM05
RMRS1
TUBS
ALUMINIUM$
    0.000     0.000   -19.000
  873.000   879.000
    0.000     0.000    19.000
   21.700    25.900
0.000 0.000 0.000
1.0000000  0.0000000  0.0000000  0.0000000  1.0000000  0.0000000  0.0000000  0.0000000  1.0000000  
//----------------------------------------------------------
RM06
RMRS1
TUBS
ALUMINIUM$
    0.000     0.000   -20.000
  873.000   879.000
    0.000     0.000    20.000
   25.900    34.200
0.000 0.000 0.000
1.0000000  0.0000000  0.0000000  0.0000000  1.0000000  0.0000000  0.0000000  0.0000000  1.0000000  
//----------------------------------------------------------
RM07
RMRS1
TUBS
ALUMINIUM$
    0.000     0.000   -21.000
  873.000   879.000
    0.000     0.000    21.000
   34.200    38.300
0.000 0.000 0.000
1.0000000  0.0000000  0.0000000  0.0000000  1.0000000  0.0000000  0.0000000  0.0000000  1.0000000  
//----------------------------------------------------------
RM08
RMRS1
TUBS
ALUMINIUM$
    0.000     0.000   -22.000
  873.000   879.000
    0.000     0.000    22.000
   38.300    42.500
0.000 0.000 0.000
1.0000000  0.0000000  0.0000000  0.0000000  1.0000000  0.0000000  0.0000000  0.0000000  1.0000000  
//----------------------------------------------------------
RM09
RMRS1
TUBS
ALUMINIUM$
    0.000     0.000   -23.000
  873.000   879.000
    0.000     0.000    23.000
   42.500    46.700
0.000 0.000 0.000
1.0000000  0.0000000  0.0000000  0.0000000  1.0000000  0.0000000  0.0000000  0.0000000  1.0000000  
//----------------------------------------------------------
RM10
RMRS1
TUBS
ALUMINIUM$
    0.000     0.000   -24.000
  873.000   879.000
    0.000     0.000    24.000
   46.700    50.900
0.000 0.000 0.000
1.0000000  0.0000000  0.0000000  0.0000000  1.0000000  0.0000000  0.0000000  0.0000000  1.0000000  
//----------------------------------------------------------
RM11
RMRS1
TUBS
ALUMINIUM$
    0.000     0.000   -25.000
  873.000   879.000
    0.000     0.000    25.000
   50.900    55.000
0.000 0.000 0.000
1.0000000  0.0000000  0.0000000  0.0000000  1.0000000  0.0000000  0.0000000  0.0000000  1.0000000  
//----------------------------------------------------------
RMRS2
RSPH
0.000 0.000 -88.500
0.0000000  0.5000000  -0.8660250  0.0000000  0.8660250  0.5000000  1.0000000  0.0000000  0.0000000  
//----------------------------------------------------------
RMRS3
RSPH
0.000 0.000 -88.500
0.0000000  -0.5000000  -0.8660250  0.0000000  0.8660250  -0.5000000  1.0000000  0.0000000  0.0000000  
//----------------------------------------------------------
RMRS4
RSPH
0.000 0.000 -88.500
0.0000000  -1.0000000  0.0000000  0.0000000  0.0000000  -1.0000000  1.0000000  0.0000000  0.0000000  
//----------------------------------------------------------
RMRS5
RSPH
0.000 0.000 -88.500
0.0000000  -0.5000000  0.8660250  0.0000000  -0.8660250  -0.5000000  1.0000000  0.0000000  0.0000000  
//----------------------------------------------------------
RMRS6
RSPH
0.000 0.000 -88.500
0.0000000  0.5000000  0.8660250  0.0000000  -0.8660250  0.5000000  1.0000000  0.0000000  0.0000000  
//----------------------------------------------------------
RSHE
RSPH
PCON
CFKSHELL$
   10.000     0.000     0.000
    0.000   360.000     0.000
  449.000   710.615   711.242
  486.159   680.917   681.571
  608.907   554.531   555.334
  648.800   500.270   501.160
  687.400   438.018   439.034
  720.800   372.712   373.906
  748.700   304.921   306.380
  771.000   234.821   236.711
  787.500   162.804   165.518
  798.100    88.289    93.200
0.000 0.000 0.000
1.0000000  0.0000000  0.0000000  0.0000000  1.0000000  0.0000000  0.0000000  0.0000000  1.0000000  
//----------------------------------------------------------
RIS3
RICH
PCON
STEEL$
    6.000     0.000     0.000
    0.000   360.000     0.000
    0.000    35.750    44.500
    2.000    35.750    44.500
    2.000    32.000    44.500
    8.000    32.000    44.500
    8.000    30.000    44.500
  134.500    30.000    44.500
0.000 0.000 225.000
1.0000000  0.0000000  0.0000000  0.0000000  1.0000000  0.0000000  0.0000000  0.0000000  1.0000000  
//----------------------------------------------------------
RIS4
RICH
PCON
STEEL$
    4.000     0.000     0.000
    0.000   360.000     0.000
  214.600    33.000    45.000
  221.600    33.000    45.000
  221.600    36.000    45.000
  224.600    36.000    45.000
0.000 0.000 0.000
1.0000000  0.0000000  0.0000000  0.0000000  1.0000000  0.0000000  0.0000000  0.0000000  1.0000000  
//----------------------------------------------------------
RIS7
RICH
PCON
STEEL$
    2.000     0.000     0.000
    0.000   360.000     0.000
    0.000    31.000    44.500
   12.000    31.000    44.500
0.000 0.000 359.500
1.0000000  0.0000000  0.0000000  0.0000000  1.0000000  0.0000000  0.0000000  0.0000000  1.0000000  
//----------------------------------------------------------
RTAM
RICH
PCON
AIR_100MBAR$
    9.000     0.000     0.000
    0.000   360.000     0.000
  179.300     0.000    32.000
  188.300     0.000    28.500
  362.300     0.000    28.500
  362.300     0.000    22.000
  382.300     0.000    22.000
  382.300     0.000    28.000
  398.800     0.000    28.000
  445.890     0.000     8.000
  449.000     0.000     8.354
0.000 0.000 0.000
1.0000000  0.0000000  0.0000000  0.0000000  1.0000000  0.0000000  0.0000000  0.0000000  1.0000000  
//----------------------------------------------------------
RBT4
RICH
PCON
ALUMINIUM$
    4.000     0.000     0.000
    0.000   360.000     0.000
   -2.931   113.200   113.200
    0.000    93.200   113.200
    3.700    47.000    92.000
   23.700    50.000    92.000
0.000 0.000 798.100
1.0000000  0.0000000  0.0000000  0.0000000  1.0000000  0.0000000  0.0000000  0.0000000  1.0000000  
//----------------------------------------------------------
RBT5
RICH
TUBE
ALUMINIUM$
    0.000     0.000   344.000
  770.000   790.000
    0.000     0.000   371.500
0.000 0.000 0.000
1.0000000  0.0000000  0.0000000  0.0000000  1.0000000  0.0000000  0.0000000  0.0000000  1.0000000  
//----------------------------------------------------------
RMSH1
RICH
PCON
CFKSHELL$
   10.000     0.000     0.000
   -0.961     0.961     0.000
  449.000   711.242   714.374
  486.159   681.571   684.838
  608.907   555.334   559.338
  648.800   501.160   505.593
  687.400   439.034   444.089
  720.800   373.906   379.828
  748.700   306.380   313.580
  771.000   236.711   245.959
  787.500   165.518   178.494
  798.100    93.200   109.200
0.000 0.000 0.000
1.0000000  0.0000000  0.0000000  0.0000000  1.0000000  0.0000000  0.0000000  0.0000000  1.0000000  
//----------------------------------------------------------
RMSH2
RICH
0.000 0.000 0.000
0.5000000  0.8660250  0.0000000  -0.8660250  0.5000000  0.0000000  0.0000000  0.0000000  1.0000000  
//----------------------------------------------------------
RMSH3
RICH
0.000 0.000 0.000
-0.5000000  0.8660250  0.0000000  -0.8660250  -0.5000000  0.0000000  0.0000000  0.0000000  1.0000000  
//----------------------------------------------------------
RMSH4
RICH
0.000 0.000 0.000
-1.0000000  0.0000000  0.0000000  0.0000000  -1.0000000  0.0000000  0.0000000  0.0000000  1.0000000  
//----------------------------------------------------------
RMSH5
RICH
0.000 0.000 0.000
-0.5000000  -0.8660250  0.0000000  0.8660250  -0.5000000  0.0000000  0.0000000  0.0000000  1.0000000  
//----------------------------------------------------------
RMSH6
RICH
0.000 0.000 0.000
0.5000000  -0.8660250  0.0000000  0.8660250  0.5000000  0.0000000  0.0000000  0.0000000  1.0000000  
//----------------------------------------------------------
RSP3
RICH
PCON
C4F10_2012$
    4.000     0.000     0.000
    0.000   360.000     0.000
  370.980    28.000    29.000
  398.800    28.000    29.000
  445.890     8.000    29.000
  449.000     8.354    29.000
0.000 0.000 0.000
1.0000000  0.0000000  0.0000000  0.0000000  1.0000000  0.0000000  0.0000000  0.0000000  1.0000000  
//----------------------------------------------------------
RBT3
RSP3
PCON
CARBON$
    4.000     0.000     0.000
    0.000   360.000     0.000
  370.980    28.000    29.000
  398.800    28.000    29.000
  445.890     8.000     9.000
  449.000     8.354     9.354
0.000 0.000 0.000
1.0000000  0.0000000  0.0000000  0.0000000  1.0000000  0.0000000  0.0000000  0.0000000  1.0000000  
//----------------------------------------------------------
RBI3
RICH
TUBE
AIR_100MBAR$
    0.000     0.000   380.980
   24.000    28.000
    0.000     0.000   382.300
0.000 0.000 0.000
1.0000000  0.0000000  0.0000000  0.0000000  1.0000000  0.0000000  0.0000000  0.0000000  1.0000000  
//----------------------------------------------------------
RBT6
RICH
PCON
ALUMINIUM$
   14.000     0.000     0.000
    0.000   360.000     0.000
  179.300    32.000    45.000
  188.300    28.500    45.000
  188.300    28.500    31.500
  221.600    28.500    31.500
  221.600    28.500    36.000
  224.900    28.500    36.000
  224.900    28.500    32.000
  230.900    28.500    32.000
  230.900    28.500    29.500
  362.300    28.500    29.500
  362.300    22.000    29.500
  364.300    22.000    29.500
  364.300    22.000    24.000
  382.300    22.000    24.000
0.000 0.000 0.000
1.0000000  0.0000000  0.0000000  0.0000000  1.0000000  0.0000000  0.0000000  0.0000000  1.0000000  
//----------------------------------------------------------
RBI4
RICH
PCON
AIR_100MBAR$
    4.000     0.000     0.000
    0.000   360.000     0.000
    3.700     0.000    47.000
   23.700     0.000    50.000
   23.700     0.000    60.000
  153.700     0.000    60.000
0.000 0.000 798.100
1.0000000  0.0000000  0.0000000  0.0000000  1.0000000  0.0000000  0.0000000  0.0000000  1.0000000  
//----------------------------------------------------------
RBI5
RICH
TUBE
KAPTON$
    0.000     0.000   130.000
    0.000    60.000
    0.000     0.000   130.100
0.000 0.000 821.800
1.0000000  0.0000000  0.0000000  0.0000000  1.0000000  0.0000000  0.0000000  0.0000000  1.0000000  
//----------------------------------------------------------
RBT7
RICH
PCON
ALUMINIUM$
    4.000     0.000     0.000
    0.000   360.000     0.000
  365.980    24.000    29.000
  370.980    24.000    29.000
  370.980    24.000    28.000
  380.980    24.000    28.000
0.000 0.000 0.000
1.0000000  0.0000000  0.0000000  0.0000000  1.0000000  0.0000000  0.0000000  0.0000000  1.0000000  
//----------------------------------------------------------
RBT8
RICH
PCON
ALUMINIUM$
    3.000     0.000     0.000
    0.000   360.000     0.000
    0.000    67.000   104.000
    4.000    67.000   104.000
   10.000    67.000    87.500
0.000 0.000 821.800
1.0000000  0.0000000  0.0000000  0.0000000  1.0000000  0.0000000  0.0000000  0.0000000  1.0000000  
//----------------------------------------------------------
RVSH
RICH
PCON
POLYPROPYLEN$
    4.000     0.000     0.000
    0.000   360.000     0.000
    0.000    60.000    67.000
  122.000    60.000    67.000
  122.000    60.000    75.000
  138.000    60.000    75.000
0.000 0.000 821.800
1.0000000  0.0000000  0.0000000  0.0000000  1.0000000  0.0000000  0.0000000  0.0000000  1.0000000  
//----------------------------------------------------------
RSHI1
RICH
PGON
POLYPROPYLEN$
  3
   80.590    18.820     1.000
    0.000    93.648   415.648
    3.000    93.648   415.648
    5.000    93.648   365.648
0.000 0.000 863.830
1.0000000  0.0000000  0.0000000  0.0000000  0.9396926  0.3420201  0.0000000  -0.3420201  0.9396926  
//----------------------------------------------------------
RSHI2
RICH
0.000 0.000 863.830
0.9396926  0.3213938  0.1169778  -0.3420201  0.8830222  0.3213938  0.0000000  -0.3420201  0.9396926  
//----------------------------------------------------------
RSHI3
RICH
0.000 0.000 863.830
0.7660444  0.6040228  0.2198463  -0.6427876  0.7198463  0.2620026  0.0000000  -0.3420201  0.9396926  
//----------------------------------------------------------
RSHI4
RICH
0.000 0.000 863.830
0.5000000  0.8137977  0.2961981  -0.8660254  0.4698463  0.1710101  0.0000000  -0.3420201  0.9396926  
//----------------------------------------------------------
RSHI5
RICH
0.000 0.000 863.830
0.1736482  0.9254166  0.3368241  -0.9848078  0.1631759  0.0593912  0.0000000  -0.3420201  0.9396926  
//----------------------------------------------------------
RSHI6
RICH
0.000 0.000 863.830
-0.1736482  0.9254166  0.3368241  -0.9848078  -0.1631759  -0.0593912  0.0000000  -0.3420201  0.9396926  
//----------------------------------------------------------
RSHI7
RICH
0.000 0.000 863.830
-0.5000000  0.8137977  0.2961981  -0.8660254  -0.4698463  -0.1710101  0.0000000  -0.3420201  0.9396926  
//----------------------------------------------------------
RSHI8
RICH
0.000 0.000 863.830
-0.7660444  0.6040228  0.2198463  -0.6427876  -0.7198463  -0.2620026  0.0000000  -0.3420201  0.9396926  
//----------------------------------------------------------
RSHI9
RICH
0.000 0.000 863.830
-0.9396926  0.3213938  0.1169778  -0.3420201  -0.8830222  -0.3213938  0.0000000  -0.3420201  0.9396926  
//----------------------------------------------------------
RSHI10
RICH
0.000 0.000 863.830
-1.0000000  0.0000000  0.0000000  0.0000000  -0.9396926  -0.3420201  0.0000000  -0.3420201  0.9396926  
//----------------------------------------------------------
RSHI11
RICH
0.000 0.000 863.830
-0.9396926  -0.3213938  -0.1169778  0.3420201  -0.8830222  -0.3213938  0.0000000  -0.3420201  0.9396926  
//----------------------------------------------------------
RSHI12
RICH
0.000 0.000 863.830
-0.7660444  -0.6040228  -0.2198463  0.6427876  -0.7198463  -0.2620026  0.0000000  -0.3420201  0.9396926  
//----------------------------------------------------------
RSHI13
RICH
0.000 0.000 863.830
-0.5000000  -0.8137977  -0.2961981  0.8660254  -0.4698463  -0.1710101  0.0000000  -0.3420201  0.9396926  
//----------------------------------------------------------
RSHI14
RICH
0.000 0.000 863.830
-0.1736482  -0.9254166  -0.3368241  0.9848078  -0.1631759  -0.0593912  0.0000000  -0.3420201  0.9396926  
//----------------------------------------------------------
RSHI15
RICH
0.000 0.000 863.830
0.1736482  -0.9254166  -0.3368241  0.9848078  0.1631759  0.0593912  0.0000000  -0.3420201  0.9396926  
//----------------------------------------------------------
RSHI16
RICH
0.000 0.000 863.830
0.5000000  -0.8137977  -0.2961981  0.8660254  0.4698463  0.1710101  0.0000000  -0.3420201  0.9396926  
//----------------------------------------------------------
RSHI17
RICH
0.000 0.000 863.830
0.7660444  -0.6040228  -0.2198463  0.6427876  0.7198463  0.2620026  0.0000000  -0.3420201  0.9396926  
//----------------------------------------------------------
RSHI18
RICH
0.000 0.000 863.830
0.9396926  -0.3213938  -0.1169778  0.3420201  0.8830222  0.3213938  0.0000000  -0.3420201  0.9396926  
//----------------------------------------------------------
